मेवेन टेस्ट प्रोब को कैसे हल करें?

एक भू-स्रोत स्रोत स्थापना के भीतर ( mvn क्लीन इंस्टॉल ), एक त्रुटि हुई।

Tests run: 552, Failures: 0, Errors: 3, Skipped: 0

[INFO] ------------------------------------------------------------------------
[INFO] Reactor Summary:
[INFO]
[INFO] GeoServer ......................................... SUCCESS [4.397s]
[INFO] Core Platform Module .............................. SUCCESS [5.694s]
[INFO] Open Web Service Module ........................... SUCCESS [9.344s]
[INFO] Main Module ....................................... SUCCESS [5:45.515s]
[INFO] Web Feature Service Module ........................ SUCCESS [6:30.520s]
[INFO] Web Coverage Service Module ....................... SUCCESS [0.922s]
[INFO] Web Map Service Module ............................ FAILURE [6:37.078s]
[INFO] GeoServer Web Modules ............................. SKIPPED
[INFO] Core UI Module .................................... SKIPPED
[INFO] GeoServer Security Modules ........................ SKIPPED
[INFO] GeoServer JDBC Security Module .................... SKIPPED
[INFO] GeoServer LDAP Security Module .................... SKIPPED
[INFO] Web Coverage Service 1.0 Module ................... SKIPPED
[INFO] Web Coverage Service 1.1 Module ................... SKIPPED
[INFO] KML support for GeoServer ......................... SKIPPED
[INFO] GeoWebCache (GWC) Module .......................... SKIPPED
[INFO] REST Support Module ............................... SKIPPED
[INFO] REST Configuration Service Module ................. SKIPPED
[INFO] WMS UI Module ..................................... SKIPPED
[INFO] GWC UI Module ..................................... SKIPPED
[INFO] WFS UI Module ..................................... SKIPPED
[INFO] Demoes Module ..................................... SKIPPED
[INFO] WCS UI Module ..................................... SKIPPED
[INFO] Security UI Modules ............................... SKIPPED
[INFO] Security UI Core Module ........................... SKIPPED
[INFO] Security UI JDBC Module ........................... SKIPPED
[INFO] Security UI LDAP Module ........................... SKIPPED
[INFO] GeoServer Web Application ......................... SKIPPED
[INFO] Community Space ................................... SKIPPED
[INFO] GeoServer Extensions .............................. SKIPPED
[INFO] ------------------------------------------------------------------------
[INFO] BUILD FAILURE
[INFO] ------------------------------------------------------------------------
[INFO] Total time: 19:16.476s
[INFO] Finished at: Mon Dec 02 15:04:31 CET 2013
[INFO] Final Memory: 72M/227M
[INFO] ------------------------------------------------------------------------
[ERROR] Failed to execute goal org.apache.maven.plugins:maven-surefire-plugin:2.12.3:test (default-test) on project wms:
 There are test failures.

भू-निर्देशक निर्देश के अनुसार, यह काम करना चाहिए। वैसे भी, मैं maven के साथ अनुभव नहीं किया है और यह त्रुटि एक ठोकरें ब्लॉक है।

इस त्रुटि को हल करने के लिए कोई संकेत है?

0
Surefire के साथ मेवेन टेस्ट-रिपोर्ट बनाता है ( target/surefire-reports के अंतर्गत)। कृपया जांचें कि असफल परीक्षणों के बारे में कोई रिपोर्ट है या नहीं, और सामग्री की जांच करें (या शायद उन्हें यहां पोस्ट करें)
जोड़ा लेखक ljgw, स्रोत

1 उत्तर

यदि आपको परीक्षणों को छोड़ना है तो -Dmaven.test.skip = true को अपने एमवीएन-कॉल में जोड़ें

mvn clean install -DskipTests

लेकिन यह दिलचस्प होगा कि परीक्षण क्यों विफल रहे, इसलिए रिपोर्ट की जांच करना निश्चित रूप से एक अच्छा विचार है।

0
जोड़ा
लेकिन यह असली समाधान नहीं है। क्या यह ?
जोड़ा लेखक Abhijit Gujar, स्रोत